Target
Carboxypeptidase B2
Ligand
BDBM173922
Substrate
Meas. Tech.
TAFI Activity Assay
pH
7.4±n/a
Temperature
298.15±n/a K
IC50
21±n/a nM
Comments
extracted
Citation
 Kallus, CBroenstrup, MEvers, AGlobisch, ASchreuder, HWagner, M Macrocyclic urea and sulfamide derivatives as inhibitors of TAFIa US Patent  US9688645 Publication Date 6/27/2017 
Target
Name:
Carboxypeptidase B2
Synonyms:
CBPB2_HUMAN CPU Carboxypeptidase B2 isoform A Plasma carboxypeptidase B Thrombin-activable fibrinolysis inhibitor | pCPB
Type:
Enzyme
Mol. Mass.:
48432.74
Organism:
Homo sapiens (Human)
Description:
Q96IY4
Residue:
423
  
Inhibitor
Name:
BDBM173922
Synonyms:
US9688645, 6-2
Type:
Small organic molecule
Emp. Form.:
C27H37N5O5
Mol. Mass.:
511.6132
SMILES:
CC(C)[C@H]1COCCCCc2ccc(C[C@@H](NC(=O)N[C@@H](Cc3ccc(N)nc3)C(O)=O)C(=O)N1)cc2
: