Target
Nociceptin receptor
Ligand
BDBM172377
Substrate
Meas. Tech.
In Vitro Delta-Opioid Receptor Binding Assay
Ki
37.9±4.1 nM
Citation
 Tanaka, NYamawaki, KYao, JYu, JZhou, X Substituted benzimidazole-type piperidine compounds and uses thereof US Patent  US9598411 Publication Date 3/21/2017 
Target
Name:
Nociceptin receptor
Synonyms:
KOR-3 Mu-type opioid receptor (Mu) Nociceptin Receptor (ORL1 Receptor) Nociceptin receptor (ORL-1) Nociceptin/Orphanin FQ, NOP receptor OPIATE ORL-1 OPRL1 protein ORL1 Opioid receptor like-1 Orphanin FQ receptor (ORL1) | P41146
Type:
G Protein-Coupled Receptor (GPCR)
Mol. Mass.:
40702.87
Organism:
Homo sapiens (Human)
Description:
P41146
Residue:
370
  
Inhibitor
Name:
BDBM172377
Synonyms:
US9090618, E30c(ii) | US9598411, Ref. No. E30c(ii)
Type:
Small organic molecule
Emp. Form.:
C31H46N4O2
Mol. Mass.:
506.7225
SMILES:
OC(=O)CN1CCC[C@@H]1c1nc2ccccc2n1[C@@H]1C[C@@H]2CCC[C@H](C1)N2C1CCCCCCCCC1
: