Target
Fibroblast growth factor receptor 1
Ligand
BDBM302394
Substrate
Meas. Tech.
High ATP Kinase Assay
IC50
14.7±n/a nM
Citation
 Collin, MBrohm, DHéroult, MLobell, MHübsch, WLustig, KGrünewald, SBömer, UVöhringer, VLindner, N Substituted benzothienyl-pyrrolotriazines and uses thereof in the treatment cancer US Patent  US9598416 Publication Date 3/21/2017 
Target
Name:
Fibroblast growth factor receptor 1
Synonyms:
BFGFR Basic fibroblast growth factor receptor 1 (FGFR1) CEK FGFR-1 FGFR-1, (FL) FGFR1_HUMAN FLT2 Fibroblast growth factor receptor 1 (FGFR-1) Fms-like tyrosine kinase 2 N-sam bFGF-R | c-fgr
Type:
Receptor
Mol. Mass.:
91861.70
Organism:
Homo sapiens (Human)
Description:
P11362
Residue:
822
  
Inhibitor
Name:
BDBM302394
Synonyms:
US9598416, Example 40
Type:
Small organic molecule
Emp. Form.:
C19H17N5O2S
Mol. Mass.:
379.436
SMILES:
COc1cc(C)cc2cc(sc12)-c1c(COCC#N)cn2ncnc(N)c12
: