Target
Fibroblast growth factor receptor 1
Ligand
BDBM302403
Substrate
Meas. Tech.
High ATP Kinase Assay
IC50
17.3±n/a nM
Citation
 Collin, MBrohm, DHéroult, MLobell, MHübsch, WLustig, KGrünewald, SBömer, UVöhringer, VLindner, N Substituted benzothienyl-pyrrolotriazines and uses thereof in the treatment cancer US Patent  US9598416 Publication Date 3/21/2017 
Target
Name:
Fibroblast growth factor receptor 1
Synonyms:
BFGFR Basic fibroblast growth factor receptor 1 (FGFR1) CEK FGFR-1 FGFR-1, (FL) FGFR1_HUMAN FLT2 Fibroblast growth factor receptor 1 (FGFR-1) Fms-like tyrosine kinase 2 N-sam bFGF-R | c-fgr
Type:
Receptor
Mol. Mass.:
91861.70
Organism:
Homo sapiens (Human)
Description:
P11362
Residue:
822
  
Inhibitor
Name:
BDBM302403
Synonyms:
US9598416, Example 49
Type:
Small organic molecule
Emp. Form.:
C23H29N5O2S
Mol. Mass.:
439.574
SMILES:
COCCN(Cc1cn2ncnc(N)c2c1-c1cc2cc(C)cc(OC)c2s1)C(C)C
: