Target
Ectonucleotide pyrophosphatase/phosphodiesterase family member 2
Ligand
BDBM192999
Substrate
Meas. Tech.
In Vitro Assay
IC50
>1000±n/a nM
Citation
 Desroy, NHeckmann, BBrys, RCJoncour, AMPeixoto, CBock, XM Compounds and pharmaceutical compositions thereof for the treatment of inflammatory disorders US Patent  US11072611 Publication Date 7/27/2021 
Target
Name:
Ectonucleotide pyrophosphatase/phosphodiesterase family member 2
Synonyms:
ATX Autotaxin (ATX) ENPP2 Ectonucleotide Pyrophosphatase/Phosphodiesterase 2 (ENPP2) Extracellular lysophospholipase D PDNP2
Type:
Enzyme
Mol. Mass.:
99007.13
Organism:
Homo sapiens (Human)
Description:
Q13822
Residue:
863
  
Inhibitor
Name:
BDBM192999
Synonyms:
US10526329, Compound 179 US9670204, 179 N-(1-(2-ethyl-3-((4-(4-fluorophenyl)thiazol-2-yl)(methyl)amino)imidazo[1,2-a]pyridin-6-yl)azetidin-3-yl)-2-(3-hydroxyazetidin-1-yl)acetamide
Type:
Small organic molecule
Emp. Form.:
C27H30FN7O2S
Mol. Mass.:
535.636
SMILES:
CCc1nc2ccc(cn2c1N(C)c1nc(cs1)-c1ccc(F)cc1)N1CC(C1)NC(=O)CN1CC(O)C1
: