Target
Bromodomain-containing protein 4 [44-168]
Ligand
BDBM209506
Substrate
Meas. Tech.
AlphaScreen Assay
IC50
12.0±n/a nM
Citation
 Engelhardt, HGianni, DSmethurst, C Triazolopyrazine US Patent  US11077107 Publication Date 8/3/2021 
Target
Name:
Bromodomain-containing protein 4 [44-168]
Synonyms:
BET bromodomain 4(1) (BRD4(1)) BRD4-BD1 protein (aa 44-168) Bromodomain protein 4 (BRD4-BD1) Bromodomain-containing protein 4 (BRD4) (aa 44-168) Bromodomain-containing protein 4 bromodomain 1 (BRD4-BD1) | HUNK1
Type:
Enzyme Catalytic Domain
Mol. Mass.:
14866.49
Organism:
Homo sapiens (Human)
Description:
aa (44-168)
Residue:
125
  
Inhibitor
Name:
BDBM209506
Synonyms:
US11077107, Example III-47 | US9266891, III-47
Type:
Small organic molecule
Emp. Form.:
C24H27N11
Mol. Mass.:
469.5449
SMILES:
CNc1nc(cn2c(C)nnc12)-c1nc2cnc(cc2n1Cc1cccnc1)N1CCN(C)CC1
: