Target
Protein arginine N-methyltransferase 5
Ligand
BDBM435709
Substrate
Meas. Tech.
Biochemical Assay
IC50
1.000±n/a nM
Citation
 Lin, HLuengo, JShetty, RHawkins, M Selective inhibitors of protein arginine methlytransferase 5 (PRMT5) US Patent  US11078205 Publication Date 8/3/2021 
Target
Name:
Protein arginine N-methyltransferase 5
Synonyms:
72 kDa ICln-binding protein HRMT1L5 IBP72 Jak-binding protein 1 PRMT5/MEP50 complex Protein arginine methyltransferase 5 (PRMT5) SKB1 homolog Shk1 kinase-binding protein 1 homolog
Type:
Enzyme
Mol. Mass.:
72679.99
Organism:
Homo sapiens (Human)
Description:
O14744
Residue:
637
  
Inhibitor
Name:
BDBM435709
Synonyms:
(2R,3S,4R,5R)-3-methyl-5-(4-methyl-7H- pyrrolo[2,3-d]pyrimidin-7-yl)-2-(((3- methylimidazo[1,2-a]pyridin-7- yl)oxy)methyl)tetrahydrofuran-3,4-diol US11078205, Example 67 | US11208416, Example 67
Type:
Small organic molecule
Emp. Form.:
C21H23N5O4
Mol. Mass.:
409.4384
SMILES:
Cc1cnc2cc(OC[C@H]3O[C@H]([C@H](O)[C@]3(C)O)n3ccc4c(C)ncnc34)ccn12
: