Target
Coagulation factor XI
Ligand
BDBM439443
Substrate
Meas. Tech.
Biological Activity Assay
IC50
13110±n/a nM
Citation
 Yang, FWang, WLi, XChen, GHe, FTao, W Oxopicolinamide derivative, preparation method therefor and pharmaceutical use thereof US Patent  US11084808 Publication Date 8/10/2021 
Target
Name:
Coagulation factor XI
Synonyms:
Coagulation factor XIa Coagulation factor XIa light chain FA11_HUMAN Factor XIa PTA | Plasma thromboplastin antecedent
Type:
Enzyme
Mol. Mass.:
70130.58
Organism:
Homo sapiens (Human)
Description:
P03951
Residue:
625
  
Inhibitor
Name:
BDBM439443
Synonyms:
(S)-4-(2-(4-(6-acetyl-3-chloro-2-fluorophenyl)-5-methoxy-2-oxopyridin-1(2H)-yl)-3-cyclobutylpropanamido)benzoic acid US11084808, Compound 161
Type:
Small organic molecule
Emp. Form.:
C28H26ClFN2O6
Mol. Mass.:
540.967
SMILES:
COc1cn([C@@H](CC2CCC2)C(=O)Nc2ccc(cc2)C(O)=O)c(=O)cc1-c1c(F)c(Cl)ccc1C(C)=O
: