Target
Replicase polyprotein 1ab
Ligand
BDBM50062648
Substrate
Meas. Tech.
Various Assay
IC50
28850±n/a nM
Citation
 Gao, KWang, RChen, JTepe, JJHuang, FWei, GW Perspectives on SARS-CoV-2 Main Protease Inhibitors. J Med Chem 64:16922-16955 (2021)  
Target
Name:
Replicase polyprotein 1ab
Synonyms:
ORF1ab polyprotein pp1ab | rep
Type:
Protein
Mol. Mass.:
794070.71
Organism:
2019-nCoV
Description:
P0DTD1
Residue:
7096
  
Inhibitor
Name:
BDBM50062648
Synonyms:
2-Chloro-4-trifluoromethyl-pyrimidine-5-carboxylic acid (3,5-bis-trifluoromethyl-phenyl)-amide SP 100030
Type:
Small organic molecule
Emp. Form.:
C14H5ClF9N3O
Mol. Mass.:
437.648
SMILES:
FC(F)(F)c1cc(NC(=O)c2cnc(Cl)nc2C(F)(F)F)cc(c1)C(F)(F)F
: