Target
Cyclin-dependent kinase 4/G1/S-specific cyclin-D1
Ligand
BDBM8069
Substrate
GST-Rb fusion protein
Meas. Tech.
CDK Kinase Inhibition Assay
Temperature
303.15±n/a K
Ki
900±n/a nM
Comments
extracted
Citation
 Wang, SMeades, CWood, GOsnowski, AAnderson, SYuill, RThomas, MMezna, MJackson, WMidgley, CGriffiths, GFleming, IGreen, SMcNae, IWu, SYMcInnes, CZheleva, DWalkinshaw, MDFischer, PM 2-Anilino-4-(thiazol-5-yl)pyrimidine CDK inhibitors: synthesis, SAR analysis, X-ray crystallography, and biological activity. J Med Chem 47:1662-75 (2004)  
Target
Name:
Cyclin-dependent kinase 4/G1/S-specific cyclin-D1
Synonyms:
CDK4/CycD CDK4/Cyclin D1 Cyclin-Dependent Kinase 4 (CDK4) Cyclin-dependent kinase 4/G1/S-specific cyclin D1 | Cyclin-dependent kinase 4/cyclin D1
Type:
Protein Complex
Mol. Mass.:
Description:
CDK4/D1 complexes were purified from insect cells co-infected with baculovirus vectors containing each of the components.
Components:
This complex has 2 components.
Component 1
Name:
Cyclin-dependent kinase 4
Synonyms:
CDK4 Cell division protein kinase 4 PSK-J3
Type:
Enzyme Subunit
Mol. Mass.:
33731.96
Organism:
Homo sapiens (Human)
Description:
P11802
Residue:
303
  
Component 2
Name:
G1/S-specific cyclin-D1
Synonyms:
B-cell lymphoma 1 protein BCL-1 oncogene CCND1 PRAD1 | PRAD1 oncogene
Type:
Enzyme Subunit
Mol. Mass.:
33717.70
Organism:
Homo sapiens (Human)
Description:
Residue:
295
  
Inhibitor
Name:
BDBM8069
Synonyms:
2-Anilino-4-(thiazol-5-yl)pyrimidine deriv. 40 CS18 | N-[4-(2-Amino-4-methyl-thiazol-5-yl)-pyrimidin-2-yl]-N, N-dimethylbenzene-1,4-diamine
Type:
Small organic molecule
Emp. Form.:
C16H18N6S
Mol. Mass.:
326.419
SMILES:
CN(C)c1ccc(Nc2nccc(n2)-c2sc(N)nc2C)cc1
:
Substrate
Name:
GST-Rb fusion protein
Synonyms:
Glutathione S-transferase (GST)-retinoblastoma (Rb) fusion RB1 Rb | retinoblastoma
Type:
Other Protein Type
Mol. Mass.:
106410.17
Organism:
Homo sapiens (Human)
Description:
GST-60 kDa Rb fusion protein (comprising amino acids 378 to 928 of retinoblastoma)
Residue:
928