Target
Rap guanine nucleotide exchange factor 4
Ligand
BDBM517684
Substrate
Meas. Tech.
In Vitro Evaluation of EPAC2 Inhibition
IC50
2200±300 nM
Citation
 Zhou, JLiu, ZYe, NMei, FCheng, X EPAC antagonists US Patent  US11124489 Publication Date 9/21/2021 
Target
Name:
Rap guanine nucleotide exchange factor 4
Synonyms:
CGEF2 EPAC2 Exchange protein directly activated by cAMP 2 RPGF4_HUMAN cAMP-regulated guanine nucleotide exchange factor II
Type:
PROTEIN
Mol. Mass.:
115526.83
Organism:
Homo sapiens (Human)
Description:
ChEMBL_1504794
Residue:
1011
  
Inhibitor
Name:
BDBM517684
Synonyms:
NY0725 | US11124489, Compound 26
Type:
Small organic molecule
Emp. Form.:
C17H10ClF3N4O3
Mol. Mass.:
410.735
SMILES:
FC(F)(F)c1cc(Cl)cc(NNC(C#N)C(=O)c2cc(on2)-c2ccco2)c1
: