Target
Rap guanine nucleotide exchange factor 4
Ligand
BDBM517687
Substrate
Meas. Tech.
In Vitro Evaluation of EPAC2 Inhibition
IC50
2200±200 nM
Citation
 Zhou, JLiu, ZYe, NMei, FCheng, X EPAC antagonists US Patent  US11124489 Publication Date 9/21/2021 
Target
Name:
Rap guanine nucleotide exchange factor 4
Synonyms:
CGEF2 EPAC2 Exchange protein directly activated by cAMP 2 RPGF4_HUMAN cAMP-regulated guanine nucleotide exchange factor II
Type:
PROTEIN
Mol. Mass.:
115526.83
Organism:
Homo sapiens (Human)
Description:
ChEMBL_1504794
Residue:
1011
  
Inhibitor
Name:
BDBM517687
Synonyms:
NY0495 | US11124489, Compound 31
Type:
Small organic molecule
Emp. Form.:
C17H10ClF3N4O2
Mol. Mass.:
394.735
SMILES:
FC(F)(F)c1cc(Cl)cc(NNC(C#N)C(=O)c2noc3ccccc23)c1
: