Target
Rap guanine nucleotide exchange factor 4
Ligand
BDBM517717
Substrate
Meas. Tech.
In Vitro Evaluation of EPAC2 Inhibition
IC50
1200±100 nM
Citation
 Zhou, JLiu, ZYe, NMei, FCheng, X EPAC antagonists US Patent  US11124489 Publication Date 9/21/2021 
Target
Name:
Rap guanine nucleotide exchange factor 4
Synonyms:
CGEF2 EPAC2 Exchange protein directly activated by cAMP 2 RPGF4_HUMAN cAMP-regulated guanine nucleotide exchange factor II
Type:
PROTEIN
Mol. Mass.:
115526.83
Organism:
Homo sapiens (Human)
Description:
ChEMBL_1504794
Residue:
1011
  
Inhibitor
Name:
BDBM517717
Synonyms:
US11124489, Entry 32 | ZL0524
Type:
Small organic molecule
Emp. Form.:
C19H17Cl2N3O
Mol. Mass.:
374.264
SMILES:
Clc1cc(Cl)cc(NNC(C#N)C(=O)c2ccc3CCCCc3c2)c1
: