Target
Plasmepsin II
Ligand
BDBM8087
Substrate
Peptide Substrate
Meas. Tech.
Enzyme Inhibition Measurements
pH
4.5±n/a
Temperature
295.15±n/a K
Ki
1100±n/a nM
Citation
 Noteberg, DSchaal, WHamelink, EVrang, LLarhed, M High-speed optimization of inhibitors of the malarial proteases plasmepsin I and II. J Comb Chem 5:456-64 (2003)  
Target
Name:
Plasmepsin II
Synonyms:
Aspartic hemoglobinase II PLM2_PLAFX Plasmepsin 2 Plasmepsin-II
Type:
Enzyme
Mol. Mass.:
51482.09
Organism:
Plasmodium falciparum
Description:
P46925
Residue:
453
  
Inhibitor
Name:
BDBM8087
Synonyms:
(2S)-N-[(2S,3S)-4-{[(1S)-2-(4-bromophenyl)-1-carbamoylethyl]amino}-3-hydroxy-1-phenylbutan-2-yl]-2-[(2E)-3-(1H-imidazol-5-yl)prop-2-enamido]-3-methylbutanamide hydroxylethylamine scaffold 5{6}
Type:
Small organic molecule
Emp. Form.:
C30H37BrN6O4
Mol. Mass.:
625.557
SMILES:
CC(C)[C@H](NC(=O)C=Cc1cnc[nH]1)C(=O)N[C@@H](Cc1ccccc1)[C@@H](O)CN[C@@H](Cc1ccc(Br)cc1)C(N)=O
:
Substrate
Name:
Peptide Substrate
Synonyms:
Type:
Peptide
Mol. Mass.:
3501.67
Organism:
Description:
Residue:
31