Target
Cathepsin D
Ligand
BDBM8087
Substrate
Peptide Substrate
Meas. Tech.
Enzyme Inhibition Measurements
Ki
>2900±n/a nM
Citation
 Noteberg, DSchaal, WHamelink, EVrang, LLarhed, M High-speed optimization of inhibitors of the malarial proteases plasmepsin I and II. J Comb Chem 5:456-64 (2003)  
Target
Name:
Cathepsin D
Synonyms:
CATD_HUMAN CTSD Cathepsin D heavy chain Cathepsin D precursor
Type:
Enzyme
Mol. Mass.:
44551.72
Organism:
Homo sapiens (Human)
Description:
Human proCathepsin D (SwissProt accession number P07339) was expressed in Sf9 cells, purified, and autoactivated.
Residue:
412
  
Inhibitor
Name:
BDBM8087
Synonyms:
(2S)-N-[(2S,3S)-4-{[(1S)-2-(4-bromophenyl)-1-carbamoylethyl]amino}-3-hydroxy-1-phenylbutan-2-yl]-2-[(2E)-3-(1H-imidazol-5-yl)prop-2-enamido]-3-methylbutanamide hydroxylethylamine scaffold 5{6}
Type:
Small organic molecule
Emp. Form.:
C30H37BrN6O4
Mol. Mass.:
625.557
SMILES:
CC(C)[C@H](NC(=O)C=Cc1cnc[nH]1)C(=O)N[C@@H](Cc1ccccc1)[C@@H](O)CN[C@@H](Cc1ccc(Br)cc1)C(N)=O
:
Substrate
Name:
Peptide Substrate
Synonyms:
Type:
Peptide
Mol. Mass.:
3501.67
Organism:
Description:
Residue:
31