Target
Signal transducer and activator of transcription 3
Ligand
BDBM50189926
Substrate
Meas. Tech.
Bioassay
IC50
5600±4000 nM
Citation
 Huryn, DMWipf, PGrandis, JRLaPorte, MGJohnston, PASchurdak, MEColombo, R 6-aryl-7-substituted-3-(1H-pyrazol-5-yl)-7H-[1,2,4]triazolo[3,4-b][1,3,4]thiadiazines as inhibitors of the STAT3 pathway with anti-proliferative activity US Patent  US11111253 Publication Date 9/7/2021 
Target
Name:
Signal transducer and activator of transcription 3
Synonyms:
APRF STAT3_HUMAN Signal transducer and activator of transcription 3 (STAT3)
Type:
Protein
Mol. Mass.:
88064.31
Organism:
Homo sapiens (Human)
Description:
P40763
Residue:
770
  
Inhibitor
Name:
BDBM50189926
Synonyms:
CHEMBL3828159 US11111253, Compound 6b
Type:
Small organic molecule
Emp. Form.:
C19H13ClN6S
Mol. Mass.:
392.865
SMILES:
Clc1cccc(c1)C1=Nn2c(SC1)nnc2-c1cc(n[nH]1)-c1ccccc1
: