Target
Lysine-specific histone demethylase 1A
Ligand
BDBM397586
Substrate
Meas. Tech.
Biochemical Assay
IC50
<100±n/a nM
Citation
 Wu, LYao, W Cyclopropylamines as LSD1 inhibitors US Patent  US11155532 Publication Date 10/26/2021 
Target
Name:
Lysine-specific histone demethylase 1A
Synonyms:
AOF2 Flavin-containing amine oxidase domain-containing protein 2 KDM1A KIAA0601 Lysine-specific demethylase 1 (LSD1) Lysine-specific histone demethylase 1 (LSD1)
Type:
Enzyme
Mol. Mass.:
92901.01
Organism:
Homo sapiens (Human)
Description:
O60341
Residue:
852
  
Inhibitor
Name:
BDBM397586
Synonyms:
US10676457, Example 85 US9994546, Example 85 | [1-[(1-hydroxycyclopentyl)carbonyl]-3-(4-{[(1R,2S)-2-phenylcyclopropyl]amino}piperidin-1-yl)azetidin-3-yl]acetonitrile
Type:
Small organic molecule
Emp. Form.:
C25H34N4O2
Mol. Mass.:
422.5631
SMILES:
OC1(CCCC1)C(=O)N1CC(CC#N)(C1)N1CCC(CC1)N[C@@H]1CC1c1ccccc1
: