Target
Bone morphogenetic protein receptor type-1B [168-495]
Ligand
BDBM522104
Substrate
Meas. Tech.
In Vitro Enzyme Inhibition Using a Biochemical Peptide Phosphorylation Assay- Caliper Assay
IC50
7000±n/a nM
Citation
 Arista, LChamoin, SD''Alessandro, PLLindvall, MLizos, DStiefl, NJTeixeira-Fouchard, SUllrich, TWeiler, S Pyridinone derivatives and their use as selective ALK-2 inhibitors US Patent  US11160797 Publication Date 11/2/2021 
Target
Name:
Bone morphogenetic protein receptor type-1B [168-495]
Synonyms:
BMPR1B Bone morphogenetic protein receptor type-1B (BMPR1B) aa 168-495
Type:
Enzyme Catalytic Domain
Mol. Mass.:
37241.56
Organism:
Homo sapiens (Human)
Description:
O00238[168-495]
Residue:
328
  
Inhibitor
Name:
BDBM522104
Synonyms:
US11160797, Example 12
Type:
Small organic molecule
Emp. Form.:
C21H16F3N3O2
Mol. Mass.:
399.3658
SMILES:
CN1C(=O)Cc2cc(ccc12)-c1cncc(c1)-c1ccc(=O)n(CC(F)(F)F)c1
: