Target
Bone morphogenetic protein receptor type-1B [168-495]
Ligand
BDBM522144
Substrate
Meas. Tech.
In Vitro Enzyme Inhibition Using a Biochemical Peptide Phosphorylation Assay- Caliper Assay
IC50
4700±n/a nM
Citation
 Arista, LChamoin, SD''Alessandro, PLLindvall, MLizos, DStiefl, NJTeixeira-Fouchard, SUllrich, TWeiler, S Pyridinone derivatives and their use as selective ALK-2 inhibitors US Patent  US11160797 Publication Date 11/2/2021 
Target
Name:
Bone morphogenetic protein receptor type-1B [168-495]
Synonyms:
BMPR1B Bone morphogenetic protein receptor type-1B (BMPR1B) aa 168-495
Type:
Enzyme Catalytic Domain
Mol. Mass.:
37241.56
Organism:
Homo sapiens (Human)
Description:
O00238[168-495]
Residue:
328
  
Inhibitor
Name:
BDBM522144
Synonyms:
US11160797, Example 52
Type:
Small organic molecule
Emp. Form.:
C22H20FN3O2
Mol. Mass.:
377.4115
SMILES:
CC(C)n1cc(ccc1=O)-c1cncc(-c2ccc3N(C)C(=O)Cc3c2)c1F
: