Target
Stimulator of interferon genes protein [155-379]
Ligand
BDBM523196
Substrate
Meas. Tech.
Binding Assay
IC50
<1000±n/a nM
Citation
 Diller, DJMetzger, AKaelin, Jr., DEPaget, SHuang, CMcguinness, BFHospital, AJSolvibile, Jr., WR Sting agonists US Patent  US11161864 Publication Date 11/2/2021 
Target
Name:
Stimulator of interferon genes protein [155-379]
Synonyms:
ERIS STING STING_HUMAN TMEM173
Type:
Enzyme Catalytic Domain
Mol. Mass.:
25427.39
Organism:
Homo sapiens (Human)
Description:
aa 155-379
Residue:
225
  
Inhibitor
Name:
BDBM523196
Synonyms:
US11161864, Example 24C
Type:
Small organic molecule
Emp. Form.:
C17H19FN10O8P2S2
Mol. Mass.:
636.471
SMILES:
Nc1nc2n(nnc2c(=O)[nH]1)[C@H]1O[C@@H]2COP(S)(=O)OCCn3c(COP(S)(=O)O[C@@H]1[C@H]2F)nc1cncnc31
: