Target
Stimulator of interferon genes protein [155-379]
Ligand
BDBM523199
Substrate
Meas. Tech.
Binding Assay
IC50
<1000±n/a nM
Citation
 Diller, DJMetzger, AKaelin, Jr., DEPaget, SHuang, CMcguinness, BFHospital, AJSolvibile, Jr., WR Sting agonists US Patent  US11161864 Publication Date 11/2/2021 
Target
Name:
Stimulator of interferon genes protein [155-379]
Synonyms:
ERIS STING STING_HUMAN TMEM173
Type:
Enzyme Catalytic Domain
Mol. Mass.:
25427.39
Organism:
Homo sapiens (Human)
Description:
aa 155-379
Residue:
225
  
Inhibitor
Name:
BDBM523199
Synonyms:
US11161864, Example 21C
Type:
Small organic molecule
Emp. Form.:
C18H19FN8O8P2S2
Mol. Mass.:
620.468
SMILES:
F[C@@H]1[C@H]2COP(S)(=O)OCCn3c(COP(S)(=O)O[C@H]1[C@@H](O2)n1cnc2c1nc[nH]c2=O)nc1cncnc31
: