Target
Stimulator of interferon genes protein [154-378]
Ligand
BDBM523202
Substrate
Meas. Tech.
Binding Assay
IC50
<1000±n/a nM
Citation
 Diller, DJMetzger, AKaelin, Jr., DEPaget, SHuang, CMcguinness, BFHospital, AJSolvibile, Jr., WR Sting agonists US Patent  US11161864 Publication Date 11/2/2021 
Target
Name:
Stimulator of interferon genes protein [154-378]
Synonyms:
Eris Mpys Stimulator of interferon genes protein (Sting1)(154-378) Sting1 | Tmem173
Type:
Enzyme Catalytic Domain
Mol. Mass.:
25501.41
Organism:
Mus musculus (Mouse)
Description:
aa 154-378
Residue:
225
  
Inhibitor
Name:
BDBM523202
Synonyms:
US11161864, Example 27C
Type:
Small organic molecule
Emp. Form.:
C19H23N9O9P2S2
Mol. Mass.:
647.518
SMILES:
CO[C@@H]1[C@H]2COP(S)(=O)OCCn3c(COP(S)(=O)O[C@H]1[C@@H](O2)n1cnc2c1nc(N)[nH]c2=O)nc1cncnc31
: