Target
Stimulator of interferon genes protein [154-378]
Ligand
BDBM523207
Substrate
Meas. Tech.
Binding Assay
IC50
<1000±n/a nM
Citation
 Diller, DJMetzger, AKaelin, Jr., DEPaget, SHuang, CMcguinness, BFHospital, AJSolvibile, Jr., WR Sting agonists US Patent  US11161864 Publication Date 11/2/2021 
Target
Name:
Stimulator of interferon genes protein [154-378]
Synonyms:
Eris Mpys Stimulator of interferon genes protein (Sting1)(154-378) Sting1 | Tmem173
Type:
Enzyme Catalytic Domain
Mol. Mass.:
25501.41
Organism:
Mus musculus (Mouse)
Description:
aa 154-378
Residue:
225
  
Inhibitor
Name:
BDBM523207
Synonyms:
US11161864, Example 29B
Type:
Small organic molecule
Emp. Form.:
C18H20FN9O7P2S3
Mol. Mass.:
651.548
SMILES:
Nc1nc2n(cnc2c(=O)[nH]1)[C@@H]1O[C@@H]2COP(S)(=O)OCCn3c(COP(S)(=S)O[C@@H]1[C@@H]2F)nc1cncnc31
: