Target
Stimulator of interferon genes protein [154-378]
Ligand
BDBM523211
Substrate
Meas. Tech.
Binding Assay
IC50
<1000±n/a nM
Citation
 Diller, DJMetzger, AKaelin, Jr., DEPaget, SHuang, CMcguinness, BFHospital, AJSolvibile, Jr., WR Sting agonists US Patent  US11161864 Publication Date 11/2/2021 
Target
Name:
Stimulator of interferon genes protein [154-378]
Synonyms:
Eris Mpys Stimulator of interferon genes protein (Sting1)(154-378) Sting1 | Tmem173
Type:
Enzyme Catalytic Domain
Mol. Mass.:
25501.41
Organism:
Mus musculus (Mouse)
Description:
aa 154-378
Residue:
225
  
Inhibitor
Name:
BDBM523211
Synonyms:
US11161864, Example 22D
Type:
Small organic molecule
Emp. Form.:
C18H21N9O8P2S2
Mol. Mass.:
617.492
SMILES:
Nc1nc2n(cnc2c(=O)[nH]1)[C@H]1O[C@@H]2C[C@H]1OP(S)(=O)OCc1nc3cncnc3n1CCOP(S)(=O)OC2
: