Target
Stimulator of interferon genes protein [154-378]
Ligand
BDBM523223
Substrate
Meas. Tech.
Binding Assay
IC50
<1000±n/a nM
Citation
 Diller, DJMetzger, AKaelin, Jr., DEPaget, SHuang, CMcguinness, BFHospital, AJSolvibile, Jr., WR Sting agonists US Patent  US11161864 Publication Date 11/2/2021 
Target
Name:
Stimulator of interferon genes protein [154-378]
Synonyms:
Eris Mpys Stimulator of interferon genes protein (Sting1)(154-378) Sting1 | Tmem173
Type:
Enzyme Catalytic Domain
Mol. Mass.:
25501.41
Organism:
Mus musculus (Mouse)
Description:
aa 154-378
Residue:
225
  
Inhibitor
Name:
BDBM523223
Synonyms:
US11161864, Example 38A US11161864, Example 38C | US11161864, Example 38D
Type:
Small organic molecule
Emp. Form.:
C20H20FN9O8P2S2
Mol. Mass.:
659.504
SMILES:
Nc1nc2n(cnc2c(=O)[nH]1)[C@@H]1O[C@@H]2COP(S)(=O)OCCn3c(COP(S)(=O)O[C@@H]1[C@@H]2F)nc1cc(cnc31)C#N
: