Target
Stimulator of interferon genes protein [154-378]
Ligand
BDBM523228
Substrate
Meas. Tech.
Binding Assay
IC50
<1000±n/a nM
Citation
 Diller, DJMetzger, AKaelin, Jr., DEPaget, SHuang, CMcguinness, BFHospital, AJSolvibile, Jr., WR Sting agonists US Patent  US11161864 Publication Date 11/2/2021 
Target
Name:
Stimulator of interferon genes protein [154-378]
Synonyms:
Eris Mpys Stimulator of interferon genes protein (Sting1)(154-378) Sting1 | Tmem173
Type:
Enzyme Catalytic Domain
Mol. Mass.:
25501.41
Organism:
Mus musculus (Mouse)
Description:
aa 154-378
Residue:
225
  
Inhibitor
Name:
BDBM523228
Synonyms:
US11161864, Example 40C
Type:
Small organic molecule
Emp. Form.:
C20H24FN9O9P2S2
Mol. Mass.:
679.535
SMILES:
COCc1ncc2nc3COP(S)(=O)O[C@@H]4[C@H](F)[C@@H](COP(S)(=O)OCCn3c2n1)O[C@H]4n1cnc2c1nc(N)[nH]c2=O
: