Target
Fibroblast growth factor receptor 4
Ligand
BDBM523849
Substrate
Meas. Tech.
FGFR4 Enzymatic Experiments
IC50
0.420±n/a nM
Citation
 Yang, HZhou, RZhou, LSun, X Fused ring derivative used as FGFR4 inhibitor US Patent  US11136320 Publication Date 10/5/2021 
Target
Name:
Fibroblast growth factor receptor 4
Synonyms:
CD_antigen: CD334 FGFR4 FGFR4 Fibroblast growth factor receptor JK2 TKF
Type:
Protein
Mol. Mass.:
87957.45
Organism:
Homo sapiens (Human)
Description:
P22455
Residue:
802
  
Inhibitor
Name:
BDBM523849
Synonyms:
US11136320, Compound 8
Type:
Small organic molecule
Emp. Form.:
C25H31N7O4S
Mol. Mass.:
525.623
SMILES:
CO[C@@H]1CCN(Cc2cc3CCCN(C(=O)Nc4cc(NCCSC)c(cn4)C#N)c3nc2OC)C1=O
: