Target
CREB-binding protein
Ligand
BDBM448576
Substrate
Meas. Tech.
Binding Assay
IC50
39.0±n/a nM
Citation
 Cyr, PBronner, SRomero, FAMagnuson, STsui, VHWai, JLai, KWWang, F Therapeutic compounds and uses thereof US Patent  US11168070 Publication Date 11/9/2021 
Target
Name:
CREB-binding protein
Synonyms:
CBP CREB-binding protein (CBP) CREBBP
Type:
Transcription Coactivator
Mol. Mass.:
265411.66
Organism:
Homo sapiens (Human)
Description:
Q92793
Residue:
2442
  
Inhibitor
Name:
BDBM448576
Synonyms:
US10696655, Example 47 | US11168070, Example 47
Type:
Small organic molecule
Emp. Form.:
C25H27F2N5O
Mol. Mass.:
451.5116
SMILES:
CCc1cc2n(C)c(=O)n(C)c2cc1N1CCCc2cc(-c3cnn(C)c3)c(cc12)C(F)F
: