Target
CREB-binding protein
Ligand
BDBM448649
Substrate
Meas. Tech.
Binding Assay
IC50
77.0±n/a nM
Citation
 Cyr, PBronner, SRomero, FAMagnuson, STsui, VHWai, JLai, KWWang, F Therapeutic compounds and uses thereof US Patent  US11168070 Publication Date 11/9/2021 
Target
Name:
CREB-binding protein
Synonyms:
CBP CREB-binding protein (CBP) CREBBP
Type:
Transcription Coactivator
Mol. Mass.:
265411.66
Organism:
Homo sapiens (Human)
Description:
Q92793
Residue:
2442
  
Inhibitor
Name:
BDBM448649
Synonyms:
(R)-8-(7-(difluoromethyl)-6-(1-methyl-1H-pyrazol-4-yl)-3,4-dihydroquinolin-1(2H)-yl)-2-methyl-2H-benzo[b][1,4]oxazin-3(4H)-one US11168070, Example 115
Type:
Small organic molecule
Emp. Form.:
C23H22F2N4O2
Mol. Mass.:
424.4432
SMILES:
C[C@H]1Oc2c(NC1=O)cccc2N1CCCc2cc(-c3cnn(C)c3)c(cc12)C(F)F
: