Target
Fibroblast growth factor receptor 1
Ligand
BDBM262051
Substrate
Meas. Tech.
Enzymatic Assay
IC50
<10±n/a nM
Citation
 Sokolsky, AWu, LYao, W Bicyclic heterocycles as FGFR4 inhibitors US Patent  US11173162 Publication Date 11/16/2021 
Target
Name:
Fibroblast growth factor receptor 1
Synonyms:
BFGFR Basic fibroblast growth factor receptor 1 (FGFR1) CEK FGFR-1 FGFR-1, (FL) FGFR1_HUMAN FLT2 Fibroblast growth factor receptor 1 (FGFR-1) Fms-like tyrosine kinase 2 N-sam bFGF-R | c-fgr
Type:
Receptor
Mol. Mass.:
91861.70
Organism:
Homo sapiens (Human)
Description:
P11362
Residue:
822
  
Inhibitor
Name:
BDBM262051
Synonyms:
3-(2,6-difluoro-3,5- dimethoxyphenyl)-1-ethyl-7-(1- methyl-1H-pyrazol-4-yl)-3,4- dihydropyrido[4,3-d]pyrimidin-2(1H)- one US10632126, Example 169 US9708318, 169
Type:
Small organic molecule
Emp. Form.:
C21H21F2N5O3
Mol. Mass.:
429.4199
SMILES:
CCN1C(=O)N(Cc2cnc(cc12)-c1cnn(C)c1)c1c(F)c(OC)cc(OC)c1F
: