Target
Fibroblast growth factor receptor 3
Ligand
BDBM262057
Substrate
Meas. Tech.
Enzymatic Assay
IC50
<10±n/a nM
Citation
 Sokolsky, AWu, LYao, W Bicyclic heterocycles as FGFR4 inhibitors US Patent  US11173162 Publication Date 11/16/2021 
Target
Name:
Fibroblast growth factor receptor 3
Synonyms:
CD_antigen: CD333 FGFR3 Fibroblast growth factor receptor JTK4
Type:
Protein
Mol. Mass.:
87699.57
Organism:
Homo sapiens (Human)
Description:
P22607
Residue:
806
  
Inhibitor
Name:
BDBM262057
Synonyms:
5-(3-(2,6-difluoro-3,5-dimethoxyphenyl)-1-ethyl-2-oxo-1,2,3,4-tetrahydropyrido[4,3-d]pyrimidin-7-yl)-N-ethylpicolinamide US10632126, Example 175 US9708318, 175
Type:
Small organic molecule
Emp. Form.:
C25H25F2N5O4
Mol. Mass.:
497.4939
SMILES:
CCNC(=O)c1ccc(cn1)-c1cc2N(CC)C(=O)N(Cc2cn1)c1c(F)c(OC)cc(OC)c1F
: