Target
Coagulation factor XI
Ligand
BDBM413654
Substrate
Meas. Tech.
Inhibition Assay
IC50
0.360±n/a nM
Citation
 Jimenez Nunez, EAckerstaff, JRoehrig, SHillisch, AMeier, KHeitmeier, STersteegen, AStampfuss, JEllerbrock, PMeibom, DLang, D Substituted oxopyridine derivatives US Patent  US11180471 Publication Date 11/23/2021 
Target
Name:
Coagulation factor XI
Synonyms:
Coagulation factor XIa Coagulation factor XIa light chain FA11_HUMAN Factor XIa PTA | Plasma thromboplastin antecedent
Type:
Enzyme
Mol. Mass.:
70130.58
Organism:
Homo sapiens (Human)
Description:
P03951
Residue:
625
  
Inhibitor
Name:
BDBM413654
Synonyms:
4-[(2-{4-[5-Chloro-2-(1,2-oxazol-3-yl)phenyl]-5-methoxy-2-oxopyridin-1(2H)-yl}-3-[(2S)-tetrahydro-2H-pyran-2-yl]propanoyl)amino]benzoic acid (Diastereomer Mixture) US10421742, Example 49 | US11180471, Example 49
Type:
Small organic molecule
Emp. Form.:
C30H28ClN3O7
Mol. Mass.:
578.012
SMILES:
COc1cn(C(C[C@@H]2CCCCO2)C(=O)Nc2ccc(cc2)C(O)=O)c(=O)cc1-c1cc(Cl)ccc1-c1ccon1
: