Target
Coagulation factor XI
Ligand
BDBM413722
Substrate
Meas. Tech.
Inhibition Assay
IC50
0.460±n/a nM
Citation
 Jimenez Nunez, EAckerstaff, JRoehrig, SHillisch, AMeier, KHeitmeier, STersteegen, AStampfuss, JEllerbrock, PMeibom, DLang, D Substituted oxopyridine derivatives US Patent  US11180471 Publication Date 11/23/2021 
Target
Name:
Coagulation factor XI
Synonyms:
Coagulation factor XIa Coagulation factor XIa light chain FA11_HUMAN Factor XIa PTA | Plasma thromboplastin antecedent
Type:
Enzyme
Mol. Mass.:
70130.58
Organism:
Homo sapiens (Human)
Description:
P03951
Residue:
625
  
Inhibitor
Name:
BDBM413722
Synonyms:
5-{[2-{4-[5-Chloro-2-(1H-tetrazol-1-yl)phenyl]-5-methoxy-2-oxopyridin-1(2H)-yl}pentanoyl]amino}pyridine-2-carboxamide (Racemate) US11180471, Example 115
Type:
Small organic molecule
Emp. Form.:
C24H23ClN8O4
Mol. Mass.:
522.944
SMILES:
CCCC(C(=O)Nc1ccc(nc1)C(N)=O)n1cc(OC)c(cc1=O)-c1cc(Cl)ccc1-n1cnnn1
: