Target
Coagulation factor XI
Ligand
BDBM413725
Substrate
Meas. Tech.
Inhibition Assay
IC50
0.260±n/a nM
Citation
 Jimenez Nunez, EAckerstaff, JRoehrig, SHillisch, AMeier, KHeitmeier, STersteegen, AStampfuss, JEllerbrock, PMeibom, DLang, D Substituted oxopyridine derivatives US Patent  US11180471 Publication Date 11/23/2021 
Target
Name:
Coagulation factor XI
Synonyms:
Coagulation factor XIa Coagulation factor XIa light chain FA11_HUMAN Factor XIa PTA | Plasma thromboplastin antecedent
Type:
Enzyme
Mol. Mass.:
70130.58
Organism:
Homo sapiens (Human)
Description:
P03951
Residue:
625
  
Inhibitor
Name:
BDBM413725
Synonyms:
N-(Quinoxalin-6-yl)-(2S)-2-{4-[5-chloro-2-(1H-tetrazol-1-yl)phenyl]-5-methoxy-2-oxopyridin-1(2H)-yl}pentanamide (Enantiomer 2) US11180471, Example 118
Type:
Small organic molecule
Emp. Form.:
C26H23ClN8O3
Mol. Mass.:
530.966
SMILES:
CCC[C@@H](C(=O)Nc1ccc2nccnc2c1)n1cc(OC)c(cc1=O)-c1cc(Cl)ccc1-n1cnnn1
: