Target
Plasma kallikrein
Ligand
BDBM408666
Substrate
Meas. Tech.
Determination of the IC50 for plasma kallikrein
IC50
8.70±n/a nM
Citation
 Davie, RLEdwards, HJEvans, DMHodgson, STPethen, SJRooker, DP Pyrazole derivatives as plasma kallikrein inhibitors US Patent  US11180484 Publication Date 11/23/2021 
Target
Name:
Plasma kallikrein
Synonyms:
Fletcher factor KLKB1 Kallikrein Plasma kallikrein heavy chain Plasma prekallikrein
Type:
Protein
Mol. Mass.:
71391.16
Organism:
Homo sapiens (Human)
Description:
P03952
Residue:
638
  
Inhibitor
Name:
BDBM408666
Synonyms:
3-Amino-1-[4-(2-oxo-2H-pyridin-1-ylmethyl)-benzyl]-1H-pyrazole-4-carboxylic acid 2-fluoro-3-methoxy-benzylamide US11001578, Example 2 US11198691, Example 2
Type:
Small organic molecule
Emp. Form.:
C25H24FN5O3
Mol. Mass.:
461.4882
SMILES:
COc1cccc(CNC(=O)c2cn(Cc3ccc(Cn4ccccc4=O)cc3)nc2N)c1F
: