Target
Plasma kallikrein
Ligand
BDBM528083
Substrate
Meas. Tech.
Determination of the IC50 for plasma kallikrein
IC50
2.00±n/a nM
Citation
 Davie, RLEdwards, HJEvans, DMHodgson, STPethen, SJRooker, DP Pyrazole derivatives as plasma kallikrein inhibitors US Patent  US11180484 Publication Date 11/23/2021 
Target
Name:
Plasma kallikrein
Synonyms:
Fletcher factor KLKB1 Kallikrein Plasma kallikrein heavy chain Plasma prekallikrein
Type:
Protein
Mol. Mass.:
71391.16
Organism:
Homo sapiens (Human)
Description:
P03952
Residue:
638
  
Inhibitor
Name:
BDBM528083
Synonyms:
3-amino-N-[(3-fluoro-4-methoxypyridin-2-yl)methyl]-1-({4-[(2-oxopyridin-1- yl)methyl]phenyl}methyl)pyrazole-4-carboxamide | US11180484, Example 5
Type:
Small organic molecule
Emp. Form.:
C24H23FN6O3
Mol. Mass.:
462.4762
SMILES:
COc1ccnc(CNC(=O)c2cn(Cc3ccc(Cn4ccccc4=O)cc3)nc2N)c1F
: