Target
Plasma kallikrein
Ligand
BDBM528099
Substrate
Meas. Tech.
Determination of the IC50 for plasma kallikrein
IC50
6.70±n/a nM
Citation
 Davie, RLEdwards, HJEvans, DMHodgson, STPethen, SJRooker, DP Pyrazole derivatives as plasma kallikrein inhibitors US Patent  US11180484 Publication Date 11/23/2021 
Target
Name:
Plasma kallikrein
Synonyms:
Fletcher factor KLKB1 Kallikrein Plasma kallikrein heavy chain Plasma prekallikrein
Type:
Protein
Mol. Mass.:
71391.16
Organism:
Homo sapiens (Human)
Description:
P03952
Residue:
638
  
Inhibitor
Name:
BDBM528099
Synonyms:
1-({4-[(5-fluoro-2-oxopyridin-1-yl)methyl]phenyl}methyl)-N-[(3-fluoro-4- methoxypyridin-2-yl)methyl]-3-(methoxymethyl)pyrazole-4-carboxamide US11584735, Compound of Formula A
Type:
Small organic molecule
Emp. Form.:
C26H25F2N5O4
Mol. Mass.:
509.5046
SMILES:
COCc1nn(Cc2ccc(Cn3cc(F)ccc3=O)cc2)cc1C(=O)NCc1nccc(OC)c1F
: