Target
Plasma kallikrein
Ligand
BDBM528124
Substrate
Meas. Tech.
Determination of the IC50 for plasma kallikrein
IC50
23.1±n/a nM
Citation
 Davie, RLEdwards, HJEvans, DMHodgson, STPethen, SJRooker, DP Pyrazole derivatives as plasma kallikrein inhibitors US Patent  US11180484 Publication Date 11/23/2021 
Target
Name:
Plasma kallikrein
Synonyms:
Fletcher factor KLKB1 Kallikrein Plasma kallikrein heavy chain Plasma prekallikrein
Type:
Protein
Mol. Mass.:
71391.16
Organism:
Homo sapiens (Human)
Description:
P03952
Residue:
638
  
Inhibitor
Name:
BDBM528124
Synonyms:
N-{[2-chloro-6-(1,2,3,4-tetrazol-1-yl)phenyl]methyl}-3-(methoxymethyl)-1-({4-[(2- oxopyridin-1-yl)methyl]phenyl}methyl)pyrazole-4-carboxamide | US11180484, Example 73
Type:
Small organic molecule
Emp. Form.:
C27H25ClN8O3
Mol. Mass.:
544.992
SMILES:
COCc1nn(Cc2ccc(Cn3ccccc3=O)cc2)cc1C(=O)NCc1c(Cl)cccc1-n1cnnn1
: