Target
Plasma kallikrein
Ligand
BDBM455297
Substrate
Meas. Tech.
Determination of the IC50 for plasma kallikrein
IC50
1.40±n/a nM
Citation
 Davie, RLEdwards, HJEvans, DMHodgson, STPethen, SJRooker, DP Pyrazole derivatives as plasma kallikrein inhibitors US Patent  US11180484 Publication Date 11/23/2021 
Target
Name:
Plasma kallikrein
Synonyms:
Fletcher factor KLKB1 Kallikrein Plasma kallikrein heavy chain Plasma prekallikrein
Type:
Protein
Mol. Mass.:
71391.16
Organism:
Homo sapiens (Human)
Description:
P03952
Residue:
638
  
Inhibitor
Name:
BDBM455297
Synonyms:
US10730874, Compound TABLE II.2 US11352356, Table II.2
Type:
Small organic molecule
Emp. Form.:
C25H28FN9O3
Mol. Mass.:
521.5467
SMILES:
COCc1nn(Cc2ccc(nc2)N2CCCC2)cc1C(=O)NCc1c(F)c(OC)ccc1-n1cnnn1
: