Target
Plasma kallikrein
Ligand
BDBM528129
Substrate
Meas. Tech.
Determination of the IC50 for plasma kallikrein
IC50
10.6±n/a nM
Citation
 Davie, RLEdwards, HJEvans, DMHodgson, STPethen, SJRooker, DP Pyrazole derivatives as plasma kallikrein inhibitors US Patent  US11180484 Publication Date 11/23/2021 
Target
Name:
Plasma kallikrein
Synonyms:
Fletcher factor KLKB1 Kallikrein Plasma kallikrein heavy chain Plasma prekallikrein
Type:
Protein
Mol. Mass.:
71391.16
Organism:
Homo sapiens (Human)
Description:
P03952
Residue:
638
  
Inhibitor
Name:
BDBM528129
Synonyms:
N-{[5-methoxy-2-(1,2,3,4-tetrazol-1-yl)phenyl]methyl}-3-(methoxymethyl)-1-{[2- (pyrrolidin-1-yl)pyrimidin-5-yl]methyl}pyrazole-4-carboxamide | US11180484, Example 80
Type:
Small organic molecule
Emp. Form.:
C24H28N10O3
Mol. Mass.:
504.5443
SMILES:
COCc1nn(Cc2cnc(nc2)N2CCCC2)cc1C(=O)NCc1cc(OC)ccc1-n1cnnn1
: