Target
Plasma kallikrein
Ligand
BDBM528133
Substrate
Meas. Tech.
Determination of the IC50 for plasma kallikrein
IC50
8.30±n/a nM
Citation
 Davie, RLEdwards, HJEvans, DMHodgson, STPethen, SJRooker, DP Pyrazole derivatives as plasma kallikrein inhibitors US Patent  US11180484 Publication Date 11/23/2021 
Target
Name:
Plasma kallikrein
Synonyms:
Fletcher factor KLKB1 Kallikrein Plasma kallikrein heavy chain Plasma prekallikrein
Type:
Protein
Mol. Mass.:
71391.16
Organism:
Homo sapiens (Human)
Description:
P03952
Residue:
638
  
Inhibitor
Name:
BDBM528133
Synonyms:
1-{[2-(3,3-difluoropyrrolidin-1-yl)pyrimidin-5-yl]methyl}-N-{[5-methoxy-2-(1,2,3,4- tetrazol-1-yl)phenyl]methyl}-3-(methoxymethyl)pyrazole-4-carboxamide | US11180484, Example 88
Type:
Small organic molecule
Emp. Form.:
C24H26F2N10O3
Mol. Mass.:
540.5252
SMILES:
COCc1nn(Cc2cnc(nc2)N2CCC(F)(F)C2)cc1C(=O)NCc1cc(OC)ccc1-n1cnnn1
: