Target
Tyrosine-protein kinase JAK1
Ligand
BDBM329978
Substrate
Meas. Tech.
JAK Caliper Enzyme Assay
IC50
31.0±n/a nM
Citation
 Fensome, AGopalsamy, AGerstenberger, BSEfremov, IVWan, ZPierce, BTelliez, JTrujillo, JIZhang, LXing, LSaiah, E Aminopyrimidinyl compounds US Patent  US11197867 Publication Date 12/14/2021 
Target
Name:
Tyrosine-protein kinase JAK1
Synonyms:
JAK-1 JAK1A JAK1_HUMAN Janus kinase 1 (JAK1) | Janus kinase 1 JAK1
Type:
Protein
Mol. Mass.:
133293.73
Organism:
Homo sapiens (Human)
Description:
P23458
Residue:
1154
  
Inhibitor
Name:
BDBM329978
Synonyms:
US10463675, Example 61 US11197867, Example 61 | US9663526, Example 61
Type:
Small organic molecule
Emp. Form.:
C23H28N8O
Mol. Mass.:
432.5214
SMILES:
CNC(=O)c1ncc(Nc2nccc(n2)N2C[C@@H]3CC[C@H](C2)N3[C@H]2C[C@@H](C2)C#N)cc1C
: