Target
Kallikrein-1
Ligand
BDBM408749
Substrate
Meas. Tech.
Inhibitory Activity In Vitro
IC50
>10000±n/a nM
Citation
 Davie, RLEdwards, HJEvans, DMHodgson, ST N-((het)arylmethyl)-heteroaryl-carboxamides compounds as kallikrein inhibitors US Patent  US11198691 Publication Date 12/14/2021 
Target
Name:
Kallikrein-1
Synonyms:
KLK1 Kallikrein 1 Kidney/pancreas/salivary gland kallikrein | Tissue kallikrein
Type:
Enzyme
Mol. Mass.:
28874.69
Organism:
Homo sapiens (Human)
Description:
P06870
Residue:
262
  
Inhibitor
Name:
BDBM408749
Synonyms:
N-{[2-(difluoromethyl)phenyl]methyl}-3-(methoxymethyl)-1-({4-[(2-oxopyridin-1- yl)methyl]phenyl}methyl)pyrazole-4-carboxamide US11001578, Example 68 US11198691, Example 68
Type:
Small organic molecule
Emp. Form.:
C27H26F2N4O3
Mol. Mass.:
492.5171
SMILES:
COCc1nn(Cc2ccc(Cn3ccccc3=O)cc2)cc1C(=O)NCc1ccccc1C(F)F
: