Target
Plasma kallikrein
Ligand
BDBM416799
Substrate
Meas. Tech.
Plasma Kallikrein Activity Assay.
Ki
25.1±n/a nM
Citation
 Kotian, PLBabu, YSWu, MChintareddy, VRKumar, VSZhang, W Human plasma kallikrein inhibitors US Patent  US11203574 Publication Date 12/21/2021 
Target
Name:
Plasma kallikrein
Synonyms:
Fletcher factor KLKB1 Kallikrein Plasma kallikrein heavy chain Plasma prekallikrein
Type:
Protein
Mol. Mass.:
71391.16
Organism:
Homo sapiens (Human)
Description:
P03952
Residue:
638
  
Inhibitor
Name:
BDBM416799
Synonyms:
2-(3-Aminomethyl-phenyl)-5-trifluoromethyl-2H-pyrazole-3-carboxylic Acid {3-[biphenyl-4-yl-(cyclopropylmethyl-amino)-methyl]-phenyl}-amide US10633345, Compound 133g US11203574, Compound 133g US11685721, Compound 133g | US11708332, Compound 133g
Type:
Small organic molecule
Emp. Form.:
C35H32F3N5O
Mol. Mass.:
595.6567
SMILES:
NCc1cccc(c1)-n1nc(cc1C(=O)Nc1cccc(c1)C(NCC1CC1)c1ccc(cc1)-c1ccccc1)C(F)(F)F
: