Target
Envelope glycoprotein gp160
Ligand
BDBM304075
Substrate
Meas. Tech.
Inhibition of HIV Replication
EC50
<100±n/a nM
Citation
 Kadow, JFNaidu, BNPatel, MPeese, KWang, Z Imidazopyridine macrocycles as inhibitors of human immunodeficiency virus replication US Patent  US10138253 Publication Date 11/27/2018 
Target
Name:
Envelope glycoprotein gp160
Synonyms:
Env polyprotein | NL4-3
Type:
Enzyme Catalytic Domain
Mol. Mass.:
97031.14
Organism:
Human immunodeficiency virus type 1 (isolate BRU/LAI group M subtypeB) (HIV-1)
Description:
Residue:
854
  
Inhibitor
Name:
BDBM304075
Synonyms:
US10138253, Example 12
Type:
Small organic molecule
Emp. Form.:
C40H45ClF2N6O6
Mol. Mass.:
779.272
SMILES:
C[C@H]1COCCOC2(C)CCN(CC2)c2c([C@H](OC(C)(C)C)C(O)=O)c(C)c(Cn3ccnn3)c3nc(c(Cl)n23)-c2cccc(c2)-c2cc(F)c(F)cc2O1
: