Target
Glutamate receptor ionotropic, NMDA 1/2B
Ligand
BDBM436768
Substrate
Meas. Tech.
Biological Assay (standard)
IC50
7.00±n/a nM
Citation
 Chrovian, CCLetavic, MARech, JCRudolph, DASoyode-Johnson, AStenne, BMWall, JL Substituted 1H-imidazo[4,5-b]pyridin-2(3H)-ones and their use as GLUN2B receptor modulators US Patent  US11207298 Publication Date 12/28/2021 
Target
Name:
Glutamate receptor ionotropic, NMDA 1/2B
Synonyms:
GluN1/GluN2B NMDA receptor Glutamate [NMDA] receptor subunit epsilon 2/zeta 1 nr2b nam
Type:
Enzyme
Mol. Mass.:
Description:
Components:
This complex has 2 components.
Component 1
Name:
Glutamate receptor ionotropic, NMDA 1
Synonyms:
GRIN1 Glutamate [NMDA] receptor subunit zeta-1 N-methyl-D-aspartate receptor subunit NR1 NMDZ1_HUMAN | phencyclidine
Type:
Enzyme Catalytic Domain
Mol. Mass.:
105397.81
Organism:
Homo sapiens (Human)
Description:
Q05586
Residue:
938
  
Component 2
Name:
Glutamate receptor ionotropic, NMDA 2B
Synonyms:
GRIN2B Glutamate [NMDA] receptor subunit epsilon 2 N-methyl D-aspartate receptor subtype 2B NMDAR2B NR3 | hNR3
Type:
PROTEIN
Mol. Mass.:
166375.46
Organism:
Homo sapiens (Human)
Description:
ChEMBL_1438829
Residue:
1484
  
Inhibitor
Name:
BDBM436768
Synonyms:
6-[5-(Difluoromethyl)-3-thienyl]-1-[2-(3-fluoroazetidin-1-yl)-2-oxo-ethyl]-3- methyl-imidazo[4,5-b]pyridin-2-one US11207298, Example 99
Type:
Small organic molecule
Emp. Form.:
C17H15F3N4O2S
Mol. Mass.:
396.387
SMILES:
Cn1c2ncc(cc2n(CC(=O)N2CC(F)C2)c1=O)-c1csc(c1)C(F)F
: