Target
Interleukin-1 beta
Ligand
BDBM531302
Substrate
Meas. Tech.
IL-1 Secretion Assa
IC50
8.30±n/a nM
Citation
 Farady, CGommermann, NJanser, PMackay, AMattes, HSmith, NSolovay, CFStiefl, NJVangrevelinghe, EVelcicky, Jvon Matt, A NLRP3 inflammasome inhibitors US Patent  US11208399 Publication Date 12/28/2021 
Target
Name:
Interleukin-1 beta
Synonyms:
IL1B IL1F2 Interleukin-1 beta | hIL-1beta
Type:
Cytokine
Mol. Mass.:
30734.47
Organism:
Homo sapiens (Human)
Description:
P01584
Residue:
269
  
Inhibitor
Name:
BDBM531302
Synonyms:
US11208399, Example 56
Type:
Small organic molecule
Emp. Form.:
C18H17F6N3O2
Mol. Mass.:
421.3369
SMILES:
Cc1cc(cc(O)c1-c1cc(c(N[C@H]2C[C@@](C)(O)C2)nn1)C(F)(F)F)C(F)(F)F
: