Target
Interleukin-1 beta
Ligand
BDBM531332
Substrate
Meas. Tech.
IL-1 Secretion Assa
IC50
0.800±n/a nM
Citation
 Farady, CGommermann, NJanser, PMackay, AMattes, HSmith, NSolovay, CFStiefl, NJVangrevelinghe, EVelcicky, Jvon Matt, A NLRP3 inflammasome inhibitors US Patent  US11208399 Publication Date 12/28/2021 
Target
Name:
Interleukin-1 beta
Synonyms:
IL1B IL1F2 Interleukin-1 beta | hIL-1beta
Type:
Cytokine
Mol. Mass.:
30734.47
Organism:
Homo sapiens (Human)
Description:
P01584
Residue:
269
  
Inhibitor
Name:
BDBM531332
Synonyms:
US11208399, Example 83a
Type:
Small organic molecule
Emp. Form.:
C20H23F3N4O2
Mol. Mass.:
408.4174
SMILES:
Cc1cc(OC(F)(F)F)cc(O)c1-c1ccc(N[C@@H]2CCCN3CCC[C@H]23)nn1
: