Target
Interleukin-1 beta
Ligand
BDBM531360
Substrate
Meas. Tech.
IL-1 Secretion Assa
IC50
7.60±n/a nM
Citation
 Farady, CGommermann, NJanser, PMackay, AMattes, HSmith, NSolovay, CFStiefl, NJVangrevelinghe, EVelcicky, Jvon Matt, A NLRP3 inflammasome inhibitors US Patent  US11208399 Publication Date 12/28/2021 
Target
Name:
Interleukin-1 beta
Synonyms:
IL1B IL1F2 Interleukin-1 beta | hIL-1beta
Type:
Cytokine
Mol. Mass.:
30734.47
Organism:
Homo sapiens (Human)
Description:
P01584
Residue:
269
  
Inhibitor
Name:
BDBM531360
Synonyms:
(3S,5R)-5-((6-(2-Hydroxy-6-methyl-4-(trifluoromethyl)phenyl)pyridazin-3-yl)amino)-1-methylpiperidin-3-ol | US11208399, Example 97
Type:
Small organic molecule
Emp. Form.:
C18H21F3N4O2
Mol. Mass.:
382.3801
SMILES:
CN1C[C@@H](O)C[C@H](C1)Nc1ccc(nn1)-c1c(C)cc(cc1O)C(F)(F)F
: