Target
Dual specificity protein kinase TTK
Ligand
BDBM532291
Substrate
Meas. Tech.
TTK Enzyme Assay
IC50
0.930±n/a nM
Citation
 De Roos, JUitdehaag, JCDe Man, APBuijsman, RCZaman, GJ Prognostic biomarkers for TTK inhibitor chemotherapy US Patent  US11208696 Publication Date 12/28/2021 
Target
Name:
Dual specificity protein kinase TTK
Synonyms:
Dual specificity protein kinase (TTK) MPS1 Monopolar Spindle 1 (MPS1) Monopolar Spindle 1 Kinase (MPS1) TTK | TTK_HUMAN
Type:
Protein
Mol. Mass.:
97086.79
Organism:
Homo sapiens (Human)
Description:
P33981
Residue:
857
  
Inhibitor
Name:
BDBM532291
Synonyms:
JDM0443A US11208696, Example 10
Type:
Small organic molecule
Emp. Form.:
C35H47N9O5
Mol. Mass.:
673.805
SMILES:
COCCOCCOCCn1nc(C)c(NC(=O)c2ccn-3c2CCc2cnc(Nc4ccc(cc4OC)N4CCN(C)CC4)nc-32)c1C
: